Reaction Details
TargetBeta-2 adrenergic receptor
LigandBDBM50070150
Substrate/Competitorn/a
Meas. Tech.ChEBML_38316
IC50 21±n/a nM
Citation Weber, AEMathvink, RJPerkins, LHutchins, JECandelore, MRTota, LStrader, CDWyvratt, MJFisher, MH Potent, selective benzenesulfonamide agonists of the human beta 3 adrenergic receptor. Bioorg Med Chem Lett8:1101-6 (1999) Beta-2 adrenergic receptor
Name:Beta-2 adrenergic receptor
Type:n/a
Mol. Mass.:46461.69
Organism:Homo sapiens (Human)
Description:P07550
Residue:413
BDBM50070150
NameBDBM50070150
Synonyms:CHEMBL13079 | N-(4-{2-[(S)-2-Hydroxy-3-(4-hydroxy-phenoxy)-propylamino]-ethyl}-phenyl)-C-phenyl-methanesulfonamide
TypeSmall organic molecule
Emp. Form.C24H28N2O5S
Mol. Mass.456.555
SMILESO[C@@H](CNCCc1ccc(NS(=O)(=O)Cc2ccccc2)cc1)COc1ccc(O)cc1