Reaction Details
TargetBeta-1 adrenergic receptor
LigandBDBM50070135
Substrate/Competitorn/a
Meas. Tech.ChEBML_37241
IC50 100±n/a nM
Citation Weber, AEMathvink, RJPerkins, LHutchins, JECandelore, MRTota, LStrader, CDWyvratt, MJFisher, MH Potent, selective benzenesulfonamide agonists of the human beta 3 adrenergic receptor. Bioorg Med Chem Lett8:1101-6 (1999) Beta-1 adrenergic receptor
Name:Beta-1 adrenergic receptor
Type:G Protein-Coupled Receptor (GPCR)
Mol. Mass.:51338.40
Organism:Homo sapiens (Human)
Description:P08588
Residue:477
BDBM50070135
NameBDBM50070135
Synonyms:CHEMBL13238 | Propane-2-sulfonic acid (4-{2-[(S)-2-hydroxy-3-(4-hydroxy-phenoxy)-propylamino]-ethyl}-phenyl)-amide
TypeSmall organic molecule
Emp. Form.C20H28N2O5S
Mol. Mass.408.512
SMILESCC(C)S(=O)(=O)Nc1ccc(CCNC[C@H](O)COc2ccc(O)cc2)cc1