Reaction Details
TargetBeta-1 adrenergic receptor
LigandBDBM50070149
Substrate/Competitorn/a
Meas. Tech.ChEBML_37241
IC50 15±n/a nM
Citation Weber, AEMathvink, RJPerkins, LHutchins, JECandelore, MRTota, LStrader, CDWyvratt, MJFisher, MH Potent, selective benzenesulfonamide agonists of the human beta 3 adrenergic receptor. Bioorg Med Chem Lett8:1101-6 (1999) Beta-1 adrenergic receptor
Name:Beta-1 adrenergic receptor
Type:G Protein-Coupled Receptor (GPCR)
Mol. Mass.:51338.40
Organism:Homo sapiens (Human)
Description:P08588
Residue:477
BDBM50070149
NameBDBM50070149
Synonyms:4-((3S)-3-{[(2S)-2-hydroxy-3-(4-hydroxyphenoxy)propyl]amino}butyl)phenol | CHEMBL12994
TypeSmall organic molecule
Emp. Form.C19H25NO4
Mol. Mass.331.4061
SMILESC[C@@H](CCc1ccc(O)cc1)NC[C@H](O)COc1ccc(O)cc1