Reaction Details
TargetBeta-1 adrenergic receptor
LigandBDBM50070148
Substrate/Competitorn/a
Meas. Tech.ChEMBL_37383 (CHEMBL649973)
IC50 2000±n/a nM
Citation Weber, AEMathvink, RJPerkins, LHutchins, JECandelore, MRTota, LStrader, CDWyvratt, MJFisher, MH Potent, selective benzenesulfonamide agonists of the human beta 3 adrenergic receptor. Bioorg Med Chem Lett8:1101-6 (1999) Beta-1 adrenergic receptor
Name:Beta-1 adrenergic receptor
Type:G Protein-Coupled Receptor (GPCR)
Mol. Mass.:51338.40
Organism:Homo sapiens (Human)
Description:P08588
Residue:477
BDBM50070148
NameBDBM50070148
Synonyms:CHEMBL274807 | Cyclohexanesulfonic acid (4-{2-[(S)-2-hydroxy-3-(4-hydroxy-phenoxy)-propylamino]-ethyl}-phenyl)-amide
TypeSmall organic molecule
Emp. Form.C23H32N2O5S
Mol. Mass.448.576
SMILESO[C@@H](CNCCc1ccc(NS(=O)(=O)C2CCCCC2)cc1)COc1ccc(O)cc1