Reaction Details
TargetChymotrypsin-like elastase family member 2A
LigandBDBM50070444
Substrate/Competitorn/a
Meas. Tech.ChEBML_158077
IC50 730±n/a nM
Citation Déziel, RMalenfant, E Inhibition of human cytomegalovirus protease N(o) with monocyclic beta-lactams. Bioorg Med Chem Lett8:1437-42 (1999) Chymotrypsin-like elastase family member 2A
Name:Chymotrypsin-like elastase family member 2A
Type:PROTEIN
Mol. Mass.:28705.23
Organism:Sus scrofa
Description:ChEMBL_156951
Residue:269
BDBM50070444
NameBDBM50070444
Synonyms:(3R,4S)-3-Methyl-2-oxo-4-(pyridin-2-ylmethylsulfanyl)-azetidine-1-carboxylic acid ((R)-1-phenyl-propyl)-amide | CHEMBL34840
TypeSmall organic molecule
Emp. Form.C20H23N3O2S
Mol. Mass.369.481
SMILESCC[C@@H](NC(=O)N1[C@@H](SCc2ccccn2)[C@H](C)C1=O)c1ccccc1