Reaction Details
TargetD(4) dopamine receptor
LigandBDBM50070518
Substrate/Competitorn/a
Meas. Tech.ChEBML_60682
Ki 42±n/a nM
Citation Belliotti, TRBrink, WAKesten, SRRubin, JRWustrow, DJZoski, KTWhetzel, SZCorbin, AEPugsley, TAHeffner, TGWise, LD Isoindolinone enantiomers having affinity for the dopamine D4 receptor. Bioorg Med Chem Lett8:1499-502 (1999) D(4) dopamine receptor
Name:D(4) dopamine receptor
Type:Enzyme
Mol. Mass.:48373.19
Organism:Homo sapiens (Human)
Description:P21917
Residue:419
BDBM50070518
NameBDBM50070518
Synonyms:(R)-3-{2-[4-(3,4-Dimethyl-phenyl)-piperazin-1-yl]-ethyl}-2,3-dihydro-isoindol-1-one PD-172939
TypeSmall organic molecule
Emp. Form.C22H27N3O
Mol. Mass.349.4693
SMILESCc1ccc(cc1C)N1CCN(CC[C@H]2NC(=O)c3ccccc23)CC1