Reaction Details
TargetD(4) dopamine receptor
LigandBDBM85093
Substrate/Competitorn/a
Meas. Tech.ChEBML_60682
Ki 0.910000±n/a nM
Citation Belliotti, TRBrink, WAKesten, SRRubin, JRWustrow, DJZoski, KTWhetzel, SZCorbin, AEPugsley, TAHeffner, TGWise, LD Isoindolinone enantiomers having affinity for the dopamine D4 receptor. Bioorg Med Chem Lett8:1499-502 (1999) D(4) dopamine receptor
Name:D(4) dopamine receptor
Type:Enzyme
Mol. Mass.:48373.19
Organism:Homo sapiens (Human)
Description:P21917
Residue:419
BDBM85093
NameBDBM85093
Synonyms:CAS_3853 CHEMBL555670 NSC_3853
TypeSmall organic molecule
Emp. Form.C18H19ClN4
Mol. Mass.326.823
SMILESClc1ccc(cc1)N1CCN(Cc2c[nH]c3ncccc23)CC1