Reaction Details
TargetReverse transcriptase/RNaseH
LigandBDBM50070533
Substrate/Competitorn/a
Meas. Tech.ChEMBL_196516 (CHEMBL798330)
IC50 30±n/a nM
Citation Sahlberg, CNoréen, REngelhardt, PHögberg, MKangasmetsä, JVrang, LZhang, H Synthesis and anti-HIV activities of urea-PETT analogs belonging to a new class of potent non-nucleoside HIV-1 reverse transcriptase inhibitors. Bioorg Med Chem Lett8:1511-6 (1999) Reverse transcriptase/RNaseH
Name:Reverse transcriptase/RNaseH
Type:PROTEIN
Mol. Mass.:65229.15
Organism:Human immunodeficiency virus 1
Description:ChEMBL_1473730
Residue:566
BDBM50070533
NameBDBM50070533
Synonyms:1-(5-Chloro-pyridin-2-yl)-3-[(1R,2R)-2-(2,6-difluoro-phenyl)-cyclopropyl]-urea | CHEMBL37762
TypeSmall organic molecule
Emp. Form.C15H12ClF2N3O
Mol. Mass.323.725
SMILESFc1cccc(F)c1[C@H]1C[C@H]1NC(=O)Nc1ccc(Cl)cn1