Reaction Details
TargetReverse transcriptase/RNaseH
LigandBDBM1866
Substrate/Competitorn/a
Meas. Tech.ChEMBL_196516 (CHEMBL798330)
IC50 700±n/a nM
Citation Sahlberg, CNoréen, REngelhardt, PHögberg, MKangasmetsä, JVrang, LZhang, H Synthesis and anti-HIV activities of urea-PETT analogs belonging to a new class of potent non-nucleoside HIV-1 reverse transcriptase inhibitors. Bioorg Med Chem Lett8:1511-6 (1999) Reverse transcriptase/RNaseH
Name:Reverse transcriptase/RNaseH
Type:PROTEIN
Mol. Mass.:65229.15
Organism:Human immunodeficiency virus 1
Description:ChEMBL_1473730
Residue:566
BDBM1866
NameBDBM1866
Synonyms:3-(5-bromopyridin-2-yl)-1-[2-(pyridin-2-yl)ethyl]thiourea hydrochloride LY300046HCl PETT deriv. | Trovirdine
TypeSmall organic molecule
Emp. Form.C13H13BrN4S
Mol. Mass.337.238
SMILESBrc1ccc(NC(=S)NCCc2ccccn2)nc1