Reaction Details
TargetReverse transcriptase/RNaseH
LigandBDBM2717
Substrate/Competitorn/a
Meas. Tech.ChEMBL_196517 (CHEMBL798331)
IC50 140±n/a nM
Citation Sahlberg, CNoréen, REngelhardt, PHögberg, MKangasmetsä, JVrang, LZhang, H Synthesis and anti-HIV activities of urea-PETT analogs belonging to a new class of potent non-nucleoside HIV-1 reverse transcriptase inhibitors. Bioorg Med Chem Lett8:1511-6 (1999) Reverse transcriptase/RNaseH
Name:Reverse transcriptase/RNaseH
Type:PROTEIN
Mol. Mass.:65229.15
Organism:Human immunodeficiency virus 1
Description:ChEMBL_1473730
Residue:566
BDBM2717
NameBDBM2717
Synonyms:1-(5-chloropyridin-2-yl)-3-[2-(2-fluoro-3,6-dimethoxyphenyl)ethyl]urea N-[2-(3,6-Dimethoxy-2-fluorophenethyl)]-N-[2-(5-chloropyridyl)]urea | urea-PETT deriv. 2
TypeSmall organic molecule
Emp. Form.C16H17ClFN3O3
Mol. Mass.353.776
SMILESCOc1ccc(OC)c(CCNC(=O)Nc2ccc(Cl)cn2)c1F