Reaction Details
TargetReverse transcriptase/RNaseH
LigandBDBM2860
Substrate/Competitorn/a
Meas. Tech.ChEMBL_196516 (CHEMBL798330)
IC50 1700±n/a nM
Citation Sahlberg, CNoréen, REngelhardt, PHögberg, MKangasmetsä, JVrang, LZhang, H Synthesis and anti-HIV activities of urea-PETT analogs belonging to a new class of potent non-nucleoside HIV-1 reverse transcriptase inhibitors. Bioorg Med Chem Lett8:1511-6 (1999) Reverse transcriptase/RNaseH
Name:Reverse transcriptase/RNaseH
Type:PROTEIN
Mol. Mass.:65229.15
Organism:Human immunodeficiency virus 1
Description:ChEMBL_1473730
Residue:566
BDBM2860
NameBDBM2860
Synonyms:1-(5-bromopyridin-2-yl)-3-[2-(2-chloro-3-ethoxy-6-fluorophenyl)ethyl]urea PETT deriv. 10
TypeSmall organic molecule
Emp. Form.C16H16BrClFN3O2
Mol. Mass.416.673
SMILESCCOc1ccc(F)c(CCNC(=O)Nc2ccc(Br)cn2)c1Cl