Reaction Details
TargetReverse transcriptase/RNaseH
LigandBDBM2720
Substrate/Competitorn/a
Meas. Tech.ChEMBL_195077 (CHEMBL797531)
IC50 100±n/a nM
Citation Sahlberg, CNoréen, REngelhardt, PHögberg, MKangasmetsä, JVrang, LZhang, H Synthesis and anti-HIV activities of urea-PETT analogs belonging to a new class of potent non-nucleoside HIV-1 reverse transcriptase inhibitors. Bioorg Med Chem Lett8:1511-6 (1999) Reverse transcriptase/RNaseH
Name:Reverse transcriptase/RNaseH
Type:PROTEIN
Mol. Mass.:65229.15
Organism:Human immunodeficiency virus 1
Description:ChEMBL_1473730
Residue:566
BDBM2720
NameBDBM2720
Synonyms:1-(5-chloropyridin-2-yl)-3-[2-(3-acetyl-2-fluoro-6-methoxyphenyl)ethyl]urea N-[2-(3-Acetyl-2-fluoro-6-methoxyphenethyl)]-N-[2-(5-chloropyridy)]urea | urea-PETT deriv. 5
TypeSmall organic molecule
Emp. Form.C17H17ClFN3O3
Mol. Mass.365.787
SMILESCOc1ccc(C(C)=O)c(F)c1CCNC(=O)Nc1ccc(Cl)cn1