Reaction Details
TargetReverse transcriptase/RNaseH
LigandBDBM2716
Substrate/Competitorn/a
Meas. Tech.ChEMBL_196517 (CHEMBL798331)
IC50 1500±n/a nM
Citation Sahlberg, CNoréen, REngelhardt, PHögberg, MKangasmetsä, JVrang, LZhang, H Synthesis and anti-HIV activities of urea-PETT analogs belonging to a new class of potent non-nucleoside HIV-1 reverse transcriptase inhibitors. Bioorg Med Chem Lett8:1511-6 (1999) Reverse transcriptase/RNaseH
Name:Reverse transcriptase/RNaseH
Type:PROTEIN
Mol. Mass.:65229.15
Organism:Human immunodeficiency virus 1
Description:ChEMBL_1473730
Residue:566
BDBM2716
NameBDBM2716
Synonyms:1-(5-bromopyridin-2-yl)-3-{2-[3-(dimethylamino)-2,6-difluorophenyl]ethyl}urea N-[2-(2,6-Difluoro-3-(dimethylamino)phenethyl)]-N-[2-(5-bromopyridyl)]urea | urea-PETT deriv. 1
TypeSmall organic molecule
Emp. Form.C16H17BrF2N4O
Mol. Mass.399.233
SMILESCN(C)c1ccc(F)c(CCNC(=O)Nc2ccc(Br)cn2)c1F