Reaction Details
TargetProthrombin
LigandBDBM50070598
Substrate/Competitorn/a
Meas. Tech.ChEBML_197824
Ki 33±n/a nM
Citation Lu, TTomczuk, BIllig, CRBone, RMurphy, LSpurlino, JSalemme, FRSoll, RM In vitro evaluation and crystallographic analysis of a new class of selective, non-amide-based thrombin inhibitors. Bioorg Med Chem Lett8:1595-600 (1999) Prothrombin
Name:Prothrombin
Type:Protein
Mol. Mass.:70029.57
Organism:Homo sapiens (Human)
Description:P00734
Residue:622
BDBM50070598
NameBDBM50070598
Synonyms:2-Chloro-benzenesulfonic acid 3-(3-guanidino-propoxy)-5-methyl-phenyl ester | CHEMBL291062
TypeSmall organic molecule
Emp. Form.C17H20ClN3O4S
Mol. Mass.397.876
SMILESCc1cc(OCCCNC(N)=N)cc(OS(=O)(=O)c2ccccc2Cl)c1