Reaction Details
TargetCytochrome c oxidase subunit 1
LigandBDBM22369
Substrate/Competitorn/a
Meas. Tech.ChEMBL_1862325 (CHEMBL4363181)
IC50>15000±n/a nM
Citation Kumar, RSaha, NPurohit, PGarg, SKSeth, KMeena, VSDubey, SDave, KGoyal, RSharma, SSBanerjee, UCChakraborti, AK Cyclic enaminone as new chemotype for selective cyclooxygenase-2 inhibitory, anti-inflammatory, and analgesic activities. Eur J Med Chem182:0 (2019) 
 
Cytochrome c oxidase subunit 1
Name:Cytochrome c oxidase subunit 1
Type:PROTEIN
Mol. Mass.:57042.74
Organism:Homo sapiens (Human)
Description:ChEMBL_746069
Residue:513
BDBM22369
NameBDBM22369
Synonyms:4-(4-methanesulfonylphenyl)-3-phenyl-2,5-dihydrofuran-2-one MK 0966 US11478464, Compound Rofecoxib | US11786535, Compound Rofecoxib
TypeSmall organic molecule
Emp. Form.C17H14O4S
Mol. Mass.314.356
SMILESCS(=O)(=O)c1ccc(cc1)C1=C(C(=O)OC1)c1ccccc1