Reaction Details
TargetBromodomain-containing protein 3
LigandBDBM50515771
Substrate/Competitorn/a
Meas. Tech.ChEMBL_1862517 (CHEMBL4363373)
Kd 2.6±n/a nM
Citation Chen, DLu, TYan, ZLu, WZhou, FLyu, XXu, BJiang, HChen, KLuo, CZhao, Y Discovery, structural insight, and bioactivities of BY27 as a selective inhibitor of the second bromodomains of BET proteins. Eur J Med Chem182:0 (2019) 
 
Bromodomain-containing protein 3
Name:Bromodomain-containing protein 3
Type:Protein
Mol. Mass.:79571.81
Organism:Homo sapiens (Human)
Description:Q15059
Residue:726
BDBM50515771
NameBDBM50515771
Synonyms:CHEMBL4528047
TypeSmall organic molecule
Emp. Form.C22H21ClN6
Mol. Mass.404.895
SMILESCc1nnc2CC[C@@H](Nc3ccc(Cl)cc3)c3cc(ccc3-n12)-c1cnn(C)c1