Reaction Details
TargetProthrombin
LigandBDBM50070823
Substrate/Competitorn/a
Meas. Tech.ChEBML_208345
Ki 0.850000±n/a nM
Citation Isaacs, RCCutrona, KJNewton, CLSanderson, PESolinsky, MGBaskin, EPChen, IWCooper, CMCook, JJGardell, SJLewis, SDLucas, RJLyle, EALynch, JJNaylor-Olsen, AMStranieri, MTVastag, KVacca, JP C6 modification of the pyridinone core of thrombin inhibitor L-374,087 as a means of enhancing its oral absorption. Bioorg Med Chem Lett8:1719-24 (1999) Prothrombin
Name:Prothrombin
Type:Protein
Mol. Mass.:70029.57
Organism:Homo sapiens (Human)
Description:P00734
Residue:622
BDBM50070823
NameBDBM50070823
Synonyms:CHEMBL45480 | N-(6-Amino-2-methyl-pyridin-3-ylmethyl)-2-(2-oxo-3-phenylmethanesulfonylamino-6-propyl-2H-pyridin-1-yl)-acetamide
TypeSmall organic molecule
Emp. Form.C24H29N5O4S
Mol. Mass.483.583
SMILESCCCc1ccc(NS(=O)(=O)Cc2ccccc2)c(=O)n1CC(=O)NCc1ccc(N)nc1C