Reaction Details
TargetDihydroorotate dehydrogenase (quinone), mitochondrial
LigandBDBM50069959
Substrate/Competitorn/a
Meas. Tech.ChEBML_52890
Ki 12±n/a nM
Citation Batt, DGPetraitis, JJSherk, SRCopeland, RADowling, RLTaylor, TLJones, EAMagolda, RLJaffee, BD Heteroatom- and carbon-linked biphenyl analogs of Brequinar as immunosuppressive agents. Bioorg Med Chem Lett8:1745-50 (1999) Dihydroorotate dehydrogenase (quinone), mitochondrial
Name:Dihydroorotate dehydrogenase (quinone), mitochondrial
Type:Enzyme
Mol. Mass.:42881.33
Organism:Homo sapiens (Human)
Description:Q02127
Residue:395
BDBM50069959
NameBDBM50069959
Synonyms:Brequinar sodium Sodium; 6-fluoro-2-(2'-fluoro-biphenyl-4-yl)-3-methyl-quinoline-4-carboxylate | US10919869, Brequinar
TypeSmall organic molecule
Emp. Form.C23H14F2NO2
Mol. Mass.374.3601
SMILESCc1c(nc2ccc(F)cc2c1C([O-])=O)-c1ccc(cc1)-c1ccccc1F