Reaction Details
TargetDihydroorotate dehydrogenase (quinone), mitochondrial
LigandBDBM50070854
Substrate/Competitorn/a
Meas. Tech.ChEBML_52890
Ki 34±n/a nM
Citation Batt, DGPetraitis, JJSherk, SRCopeland, RADowling, RLTaylor, TLJones, EAMagolda, RLJaffee, BD Heteroatom- and carbon-linked biphenyl analogs of Brequinar as immunosuppressive agents. Bioorg Med Chem Lett8:1745-50 (1999) Dihydroorotate dehydrogenase (quinone), mitochondrial
Name:Dihydroorotate dehydrogenase (quinone), mitochondrial
Type:Enzyme
Mol. Mass.:42881.33
Organism:Homo sapiens (Human)
Description:Q02127
Residue:395
BDBM50070854
NameBDBM50070854
Synonyms:CHEMBL50279 | Sodium; 6-fluoro-2-[4-(3-methoxy-phenyl)-2,3-dihydro-indol-1-yl]-3-methyl-quinoline-4-carboxylate
TypeSmall organic molecule
Emp. Form.C26H20FN2O3
Mol. Mass.427.4476
SMILESCOc1cccc(c1)-c1cccc2N(CCc12)c1nc2ccc(F)cc2c(C([O-])=O)c1C