Reaction Details
TargetAurora kinase A
LigandBDBM50516346
Substrate/Competitorn/a
Meas. Tech.ChEMBL_1864332 (CHEMBL4365307)
IC50 0.012000±n/a nM
Citation Zhang, JWang, SBa, YXu, Z Tetrazole hybrids with potential anticancer activity. Eur J Med Chem178:341-351 (2019) 
 
Aurora kinase A
Name:Aurora kinase A
Type:Serine/threonine-protein kinase
Mol. Mass.:45830.98
Organism:Homo sapiens (Human)
Description:O14965
Residue:403
BDBM50516346
NameBDBM50516346
Synonyms:CHEMBL4476212
TypeSmall organic molecule
Emp. Form.C17H11ClFN7O
Mol. Mass.383.767
SMILESFc1ccc(Oc2nc(Nc3ccc(cc3)-c3nnn[nH]3)ncc2Cl)cc1