Reaction Details
TargetMatrilysin
LigandBDBM50064341
Substrate/Competitorn/a
Meas. Tech.ChEBML_102103
IC50 3±n/a nM
Citation Steinman, DHCurtin, MLGarland, RBDavidsen, SKHeyman, HRHolms, JHAlbert, DHMagoc, TJNagy, IBMarcotte, PALi, JMorgan, DWHutchins, CSummers, JB The design, synthesis, and structure-activity relationships of a series of macrocyclic MMP inhibitors. Bioorg Med Chem Lett8:2087-92 (1999) Matrilysin
Name:Matrilysin
Type:Enzyme
Mol. Mass.:29681.54
Organism:Homo sapiens (Human)
Description:P09237
Residue:267
BDBM50064341
NameBDBM50064341
Synonyms:(6S,7R,10S)-7-Isobutyl-8-oxo-2-oxa-9-aza-bicyclo[10.2.2]hexadeca-1(15),12(16),13-triene-6,10-dicarboxylic acid 6-hydroxyamide 10-methylamide CHEMBL45631
TypeSmall organic molecule
Emp. Form.C21H31N3O5
Mol. Mass.405.4879
SMILESCNC(=O)[C@@H]1Cc2ccc(OCCC[C@@H]([C@@H](CC(C)C)C(=O)N1)C(=O)NO)cc2