Reaction Details
TargetSerine protease 1
LigandBDBM17277
Substrate/Competitorn/a
Meas. Tech.ChEBML_212510
Ki 30±n/a nM
Citation Buckman, BOMohan, RKoovakkat, SLiang, ATrinh, LMorrissey, MM Design, synthesis, and biological activity of novel purine and bicyclic pyrimidine factor Xa inhibitors. Bioorg Med Chem Lett8:2235-40 (1999) Serine protease 1
Name:Serine protease 1
Type:Enzyme
Mol. Mass.:25790.52
Organism:Bos taurus (bovine)
Description:P00760
Residue:246
BDBM17277
NameBDBM17277
Synonyms:(Z,Z)BABCH CHEMBL55035
TypeSmall organic molecule
Emp. Form.C23H24N4O
Mol. Mass.372.4629
SMILESNC(=N)c1ccc(\C=C2\CCCC\C(=C\c3ccc(cc3)C(N)=N)C2=O)cc1