Reaction Details
TargetEndothelin-1 receptor
LigandBDBM50071438
Substrate/Competitorn/a
Meas. Tech.ChEBML_65820
Ki 45±n/a nM
Citation Sakaki, JMurata, TYuumoto, YNakamura, ITrueh, TPitterna, TIwasaki, GOda, KYamamura, THayakawa, K Discovery of IRL 3461: a novel and potent endothelin antagonist with balanced ETA/ETB affinity. Bioorg Med Chem Lett8:2241-6 (1999) Endothelin-1 receptor
Name:Endothelin-1 receptor
Type:Enzyme Catalytic Domain
Mol. Mass.:48736.88
Organism:Homo sapiens (Human)
Description:P25101
Residue:427
BDBM50071438
NameBDBM50071438
Synonyms:(S)-2-[(R)-2-[(3,5-Dimethyl-benzoyl)-methyl-amino]-3-(4-isoxazol-5-yl-phenyl)-propionylamino]-3-(1H-indol-3-yl)-propionic acid | CHEMBL433106
TypeSmall organic molecule
Emp. Form.C33H32N4O5
Mol. Mass.564.631
SMILESCN([C@H](Cc1ccc(cc1)-c1ccno1)C(=O)N[C@@H](Cc1c[nH]c2ccccc12)C(O)=O)C(=O)c1cc(C)cc(C)c1