Reaction Details
TargetKelch-like ECH-associated protein 1
LigandBDBM50200467
Substrate/Competitorn/a
Meas. Tech.ChEMBL_1866578 (CHEMBL4367553)
IC50 140±n/a nM
Citation Lu, MCZhang, XWu, FTan, SJZhao, JYou, QDJiang, ZY Discovery of a Potent Kelch-Like ECH-Associated Protein 1-Nuclear Factor Erythroid 2-Related Factor 2 (Keap1-Nrf2) Protein-Protein Interaction Inhibitor with Natural Proline Structure as a Cytoprotective Agent against Acetaminophen-Induced Hepatotoxicity. J Med Chem62:6796-6813 (2019) 
 
Kelch-like ECH-associated protein 1
Name:Kelch-like ECH-associated protein 1
Type:PROTEIN
Mol. Mass.:69664.53
Organism:Homo sapiens (Human)
Description:ChEMBL_107924
Residue:624
BDBM50200467
NameBDBM50200467
Synonyms:CHEMBL3899754
TypeSmall organic molecule
Emp. Form.C25H28N2O4S
Mol. Mass.452.566
SMILESCc1cc(C)c(C)c(c1C)S(=O)(=O)Nc1ccc(N2CC[C@@H](C2)C(O)=O)c2ccccc12