Reaction Details
TargetMannose-6-phosphate isomerase
LigandBDBM50071516
Substrate/Competitorn/a
Meas. Tech.ChEMBL_222752 (CHEMBL846958)
Ki 26000±n/a nM
Citation Bhandari, AJones, DGSchullek, JRVo, KSchunk, CATamanaha, LLChen, DYuan, ZNeedels, MCGallop, MA Exploring structure-activity relationships around the phosphomannose isomerase inhibitor AF14049 via combinatorial synthesis. Bioorg Med Chem Lett8:2303-8 (1999) Mannose-6-phosphate isomerase
Name:Mannose-6-phosphate isomerase
Type:PROTEIN
Mol. Mass.:46651.35
Organism:Homo sapiens (Human)
Description:ChEMBL_1448919
Residue:423
BDBM50071516
NameBDBM50071516
Synonyms:2-[4-(3,4-Dichloro-phenylsulfanyl)-butyrylamino]-indan-2-carboxylic acid hydroxyamide | CHEMBL419459
TypeSmall organic molecule
Emp. Form.C20H20Cl2N2O3S
Mol. Mass.439.355
SMILESONC(=O)C1(Cc2ccccc2C1)NC(=O)CCCSc1ccc(Cl)c(Cl)c1