Reaction Details
TargetAlpha-1A adrenergic receptor
LigandBDBM50071647
Substrate/Competitorn/a
Meas. Tech.ChEMBL_32876 (CHEMBL648629)
Ki 74±n/a nM
Citation Nerenberg, JBErb, JMThompson, WJLee, HYGuare, JPMunson, PMBergman, JMHuff, JRBroten, TPChang, RSChen, TBO'Malley, SSchorn, TWScott, AL Design and synthesis of N-alkylated saccharins as selective alpha-1a adrenergic receptor antagonists. Bioorg Med Chem Lett8:2467-72 (1999) Alpha-1A adrenergic receptor
Name:Alpha-1A adrenergic receptor
Type:Cell-surface receptors
Mol. Mass.:51511.67
Organism:Homo sapiens (Human)
Description:P35348
Residue:466
BDBM50071647
NameBDBM50071647
Synonyms:3-{1-[4-(5-Chloro-1,1,3-trioxo-1,3-dihydro-1lambda*6*-benzo[d]isothiazol-2-yl)-butyl]-piperidin-4-yl}-3H-benzooxazol-2-one | CHEMBL313990
TypeSmall organic molecule
Emp. Form.C23H24ClN3O5S
Mol. Mass.489.972
SMILESClc1ccc2c(c1)C(=O)N(CCCCN1CCC(CC1)n1c3ccccc3oc1=O)S2(=O)=O