Reaction Details
TargetAlpha-1B adrenergic receptor
LigandBDBM50071658
Substrate/Competitorn/a
Meas. Tech.ChEMBL_32895 (CHEMBL648798)
Ki 6.8±n/a nM
Citation Nerenberg, JBErb, JMThompson, WJLee, HYGuare, JPMunson, PMBergman, JMHuff, JRBroten, TPChang, RSChen, TBO'Malley, SSchorn, TWScott, AL Design and synthesis of N-alkylated saccharins as selective alpha-1a adrenergic receptor antagonists. Bioorg Med Chem Lett8:2467-72 (1999) Alpha-1B adrenergic receptor
Name:Alpha-1B adrenergic receptor
Type:Enzyme
Mol. Mass.:56862.13
Organism:Homo sapiens (Human)
Description:P35368
Residue:520
BDBM50071658
NameBDBM50071658
Synonyms:3-{1-[4-(6-Methanesulfonyl-1,1,3-trioxo-1,3-dihydro-1lambda*6*-benzo[d]isothiazol-2-yl)-butyl]-piperidin-4-yl}-3H-benzooxazol-2-one | CHEMBL81173
TypeSmall organic molecule
Emp. Form.C24H27N3O7S2
Mol. Mass.533.617
SMILESCS(=O)(=O)c1ccc2C(=O)N(CCCCN3CCC(CC3)n3c4ccccc4oc3=O)S(=O)(=O)c2c1