Reaction Details
TargetAlpha-1A adrenergic receptor
LigandBDBM50071653
Substrate/Competitorn/a
Meas. Tech.ChEBML_32888
Ki 0.160000±n/a nM
Citation Nerenberg, JBErb, JMThompson, WJLee, HYGuare, JPMunson, PMBergman, JMHuff, JRBroten, TPChang, RSChen, TBO'Malley, SSchorn, TWScott, AL Design and synthesis of N-alkylated saccharins as selective alpha-1a adrenergic receptor antagonists. Bioorg Med Chem Lett8:2467-72 (1999) Alpha-1A adrenergic receptor
Name:Alpha-1A adrenergic receptor
Type:Cell-surface receptors
Mol. Mass.:51511.67
Organism:Homo sapiens (Human)
Description:P35348
Residue:466
BDBM50071653
NameBDBM50071653
Synonyms:3-{1-[4-(6-Nitro-1,1,3-trioxo-1,3-dihydro-1lambda*6*-benzo[d]isothiazol-2-yl)-butyl]-piperidin-4-yl}-3H-benzooxazol-2-one | CHEMBL82877
TypeSmall organic molecule
Emp. Form.C23H24N4O7S
Mol. Mass.500.524
SMILES[O-][N+](=O)c1ccc2C(=O)N(CCCCN3CCC(CC3)n3c4ccccc4oc3=O)S(=O)(=O)c2c1