Reaction Details
TargetD(1A) dopamine receptor
LigandBDBM50071958
Substrate/Competitorn/a
Meas. Tech.ChEBML_60496
Ki>10000±n/a nM
Citation Yuan, JChen, XBrodbeck, RPrimus, RBraun, JWasley, JWThurkauf, A NGB 2904 and NGB 2849: two highly selective dopamine D3 receptor antagonists. Bioorg Med Chem Lett8:2715-8 (1999) D(1A) dopamine receptor
Name:D(1A) dopamine receptor
Type:Enzyme
Mol. Mass.:49303.43
Organism:Homo sapiens (Human)
Description:P21728
Residue:446
BDBM50071958
NameBDBM50071958
Synonyms:Biphenylene-2-carboxylic acid {4-[4-(2,3-dichloro-phenyl)-piperazin-1-yl]-butyl}-amide | CHEMBL419505
TypeSmall organic molecule
Emp. Form.C27H27Cl2N3O
Mol. Mass.480.429
SMILESClc1cccc(N2CCN(CCCCNC(=O)c3ccc4-c5ccccc5-c4c3)CC2)c1Cl