Reaction Details
TargetCaspase-1
LigandBDBM50072041
Substrate/Competitorn/a
Meas. Tech.ChEBML_46514
IC50 186±n/a nM
Citation Karanewsky, DSBai, XLinton, SDKrebs, JFWu, JPham, BTomaselli, KJ Conformationally constrained inhibitors of caspase-1 (interleukin-1 beta converting enzyme) and of the human CED-3 homologue caspase-3 (CPP32, apopain). Bioorg Med Chem Lett8:2757-62 (1999) Caspase-1
Name:Caspase-1
Type:PROTEIN
Mol. Mass.:45636.44
Organism:Mus musculus
Description:ChEMBL_651546
Residue:402
BDBM50072041
NameBDBM50072041
Synonyms:CHEMBL314286 | {(S)-1-[(S)-1-((S)-2-Hydroxy-5-oxo-tetrahydro-furan-3-ylcarbamoyl)-ethyl]-2-oxo-azepan-3-yl}-carbamic acid benzyl ester
TypeSmall organic molecule
Emp. Form.C21H27N3O7
Mol. Mass.433.455
SMILESC[C@H](N1CCCC[C@H](NC(=O)OCc2ccccc2)C1=O)C(=O)N[C@H]1CC(=O)OC1O