Reaction Details
TargetAdenosine receptor A1
LigandBDBM50517301
Substrate/Competitorn/a
Meas. Tech.ChEMBL_1868854 (CHEMBL4369920)
Ki 0.380000±n/a nM
Citation Tosh, DKRao, HBitant, ASalmaso, VMannes, PLieberman, DIVaughan, KLMattison, JARothwell, ACAuchampach, JACiancetta, ALiu, NCui, ZGao, ZGReitman, MLGavrilova, OJacobson, KA Design and in Vivo Characterization of A J Med Chem62:1502-1522 (2019) 
 
Adenosine receptor A1
Name:Adenosine receptor A1
Type:G Protein-Coupled Receptor (GPCR)
Mol. Mass.:36520.92
Organism:Homo sapiens (Human)
Description:P30542
Residue:326
BDBM50517301
NameBDBM50517301
Synonyms:CHEMBL1877326
TypeSmall organic molecule
Emp. Form.C17H23N5O4
Mol. Mass.361.3956
SMILES[H][C@]12CC[C@]([H])(C1)[C@H](C2)Nc1ncnc2n(cnc12)[C@@H]1O[C@H](CO)[C@@H](O)[C@H]1O