Reaction Details
TargetInositol hexakisphosphate kinase 2
LigandBDBM50187658
Substrate/Competitorn/a
Meas. Tech.ChEMBL_1868987 (CHEMBL4370053)
IC50 24000±n/a nM
Citation Gu, CStashko, MAPuhl-Rubio, ACChakraborty, MChakraborty, AFrye, SVPearce, KHWang, XShears, SBWang, H Inhibition of Inositol Polyphosphate Kinases by Quercetin and Related Flavonoids: A Structure-Activity Analysis. J Med Chem62:1443-1454 (2019) 
 
Inositol hexakisphosphate kinase 2
Name:Inositol hexakisphosphate kinase 2
Type:PROTEIN
Mol. Mass.:49188.38
Organism:Homo sapiens
Description:ChEMBL_119238
Residue:426
BDBM50187658
NameBDBM50187658
Synonyms:4',5-dihydroxy-7-methoxy flavone 5-hydroxy-2-(4-hydroxyphenyl)-7-methoxy-4H-chromen-4-one CHEMBL210635 genkwanin
TypeSmall organic molecule
Emp. Form.C16H12O5
Mol. Mass.284.2635
SMILESCOc1cc(O)c2c(c1)oc(cc2=O)-c1ccc(O)cc1