Reaction Details
TargetcAMP-specific 3',5'-cyclic phosphodiesterase 4D
LigandBDBM50072195
Substrate/Competitorn/a
Meas. Tech.ChEBML_155178
IC50 60±n/a nM
Citation Charpiot, BBrun, JDonze, INaef, RStefani, MMueller, T Quinazolines: combined type 3 and 4 phosphodiesterase inhibitors. Bioorg Med Chem Lett8:2891-6 (1999) cAMP-specific 3',5'-cyclic phosphodiesterase 4D
Name:cAMP-specific 3',5'-cyclic phosphodiesterase 4D
Type:Protein
Mol. Mass.:91092.69
Organism:Homo sapiens (Human)
Description:Q08499
Residue:809
BDBM50072195
NameBDBM50072195
Synonyms:2-[4-(3,5-Bis-cyclopropylmethoxy-phenyl)-2-ethoxy-6-methoxy-quinazolin-7-yloxy]-ethanol | CHEMBL97214
TypeSmall organic molecule
Emp. Form.C27H32N2O6
Mol. Mass.480.5528
SMILESCCOc1nc(-c2cc(OCC3CC3)cc(OCC3CC3)c2)c2cc(OC)c(OCCO)cc2n1