Reaction Details
TargetcAMP-specific 3',5'-cyclic phosphodiesterase 4A
LigandBDBM50072204
Substrate/Competitorn/a
Meas. Tech.ChEBML_155032
IC50 540±n/a nM
Citation Charpiot, BBrun, JDonze, INaef, RStefani, MMueller, T Quinazolines: combined type 3 and 4 phosphodiesterase inhibitors. Bioorg Med Chem Lett8:2891-6 (1999) cAMP-specific 3',5'-cyclic phosphodiesterase 4A
Name:cAMP-specific 3',5'-cyclic phosphodiesterase 4A
Type:Enzyme
Mol. Mass.:98113.27
Organism:Homo sapiens (Human)
Description:P27815
Residue:886
BDBM50072204
NameBDBM50072204
Synonyms:2-[4-(3,5-Bis-cyclopropylmethoxy-phenyl)-2-ethylsulfanyl-6-methoxy-quinazolin-7-yloxy]-ethanol | CHEMBL99101
TypeSmall organic molecule
Emp. Form.C27H32N2O5S
Mol. Mass.496.618
SMILESCCSc1nc(-c2cc(OCC3CC3)cc(OCC3CC3)c2)c2cc(OC)c(OCCO)cc2n1