Reaction Details
TargetcAMP-specific 3',5'-cyclic phosphodiesterase 4A
LigandBDBM50072211
Substrate/Competitorn/a
Meas. Tech.ChEBML_155032
IC50 70.0±n/a nM
Citation Charpiot, BBrun, JDonze, INaef, RStefani, MMueller, T Quinazolines: combined type 3 and 4 phosphodiesterase inhibitors. Bioorg Med Chem Lett8:2891-6 (1999) cAMP-specific 3',5'-cyclic phosphodiesterase 4A
Name:cAMP-specific 3',5'-cyclic phosphodiesterase 4A
Type:Enzyme
Mol. Mass.:98113.27
Organism:Homo sapiens (Human)
Description:P27815
Residue:886
BDBM50072211
NameBDBM50072211
Synonyms:2-[4-(3,5-Bis-cyclopropylmethoxy-phenyl)-7-(2-hydroxy-ethoxy)-6-methoxy-quinazolin-2-yloxy]-ethanol | CHEMBL98662
TypeSmall organic molecule
Emp. Form.C27H32N2O7
Mol. Mass.496.5522
SMILESCOc1cc2c(nc(OCCO)nc2cc1OCCO)-c1cc(OCC2CC2)cc(OCC2CC2)c1