Reaction Details
TargetcAMP-specific 3',5'-cyclic phosphodiesterase 4D
LigandBDBM50072198
Substrate/Competitorn/a
Meas. Tech.ChEBML_155178
IC50 1200±n/a nM
Citation Charpiot, BBrun, JDonze, INaef, RStefani, MMueller, T Quinazolines: combined type 3 and 4 phosphodiesterase inhibitors. Bioorg Med Chem Lett8:2891-6 (1999) cAMP-specific 3',5'-cyclic phosphodiesterase 4D
Name:cAMP-specific 3',5'-cyclic phosphodiesterase 4D
Type:Protein
Mol. Mass.:91092.69
Organism:Homo sapiens (Human)
Description:Q08499
Residue:809
BDBM50072198
NameBDBM50072198
Synonyms:4-(3,5-Diisopropoxy-phenyl)-6,7-dimethoxy-2-methyl-quinazoline | CHEMBL420999
TypeSmall organic molecule
Emp. Form.C23H28N2O4
Mol. Mass.396.4794
SMILESCOc1cc2nc(C)nc(-c3cc(OC(C)C)cc(OC(C)C)c3)c2cc1OC