Reaction Details
Target3-oxo-5-alpha-steroid 4-dehydrogenase 1
LigandBDBM50340481
Substrate/Competitorn/a
Meas. Tech.ChEMBL_1869969 (CHEMBL4371136)
IC50 4.0±n/a nM
Citation Meanwell, NA Fluorine and Fluorinated Motifs in the Design and Application of Bioisosteres for Drug Design. J Med Chem61:5822-5880 (2018) 
 
3-oxo-5-alpha-steroid 4-dehydrogenase 1
Name:3-oxo-5-alpha-steroid 4-dehydrogenase 1
Type:Enzyme
Mol. Mass.:29472.80
Organism:Homo sapiens (Human)
Description:P18405
Residue:259
BDBM50340481
NameBDBM50340481
Synonyms:Avodart DUTASTERIDE GI-198745
TypeSmall organic molecule
Emp. Form.C27H30F6N2O2
Mol. Mass.528.5297
SMILESC[C@]12CC[C@H]3[C@@H](CC[C@H]4NC(=O)C=C[C@]34C)[C@@H]1CC[C@@H]2C(=O)Nc1cc(ccc1C(F)(F)F)C(F)(F)F