Reaction Details
Target5-hydroxytryptamine receptor 1A
LigandBDBM50151988
Substrate/Competitorn/a
Meas. Tech.ChEMBL_1869989 (CHEMBL4371156)
IC50 1.000000±n/a nM
Citation Meanwell, NA Fluorine and Fluorinated Motifs in the Design and Application of Bioisosteres for Drug Design. J Med Chem61:5822-5880 (2018) 
 
5-hydroxytryptamine receptor 1A
Name:5-hydroxytryptamine receptor 1A
Type:n/a
Mol. Mass.:46122.49
Organism:Homo sapiens (Human)
Description:n/a
Residue:422
BDBM50151988
NameBDBM50151988
Synonyms:3-{4-[4-(2,3-Dihydro-benzo[1,4]dioxin-6-yl)-piperazin-1-yl]-butyl}-1H-indole-5-carbonitrile | CHEMBL189709
TypeSmall organic molecule
Emp. Form.C25H28N4O2
Mol. Mass.416.5154
SMILESN#Cc1ccc2[nH]cc(CCCCN3CCN(CC3)c3ccc4OCCOc4c3)c2c1