Reaction Details
Target3-oxo-5-alpha-steroid 4-dehydrogenase 1
LigandBDBM50517880
Substrate/Competitorn/a
Meas. Tech.ChEMBL_1869969 (CHEMBL4371136)
IC50 3.9±n/a nM
Citation Meanwell, NA Fluorine and Fluorinated Motifs in the Design and Application of Bioisosteres for Drug Design. J Med Chem61:5822-5880 (2018) 
 
3-oxo-5-alpha-steroid 4-dehydrogenase 1
Name:3-oxo-5-alpha-steroid 4-dehydrogenase 1
Type:Enzyme
Mol. Mass.:29472.80
Organism:Homo sapiens (Human)
Description:P18405
Residue:259
BDBM50517880
NameBDBM50517880
Synonyms:CHEMBL4569322
TypeSmall organic molecule
Emp. Form.C28H32F6N2O2
Mol. Mass.542.5563
SMILES[H][C@@]12CC[C@H](C(=O)NC(c3ccccc3)(C(F)(F)F)C(F)(F)F)[C@@]1(C)CC[C@@]1([H])[C@@]2([H])CC[C@@]2([H])NC(=O)C=C[C@]12C