Reaction Details
TargetMatrix metalloproteinase-14
LigandBDBM50518291
Substrate/Competitorn/a
Meas. Tech.ChEMBL_1871065 (CHEMBL4372232)
IC50 7.0±n/a nM
Citation Cuffaro, DNuti, EGifford, VIto, NCamodeca, CTuccinardi, TNencetti, SOrlandini, EItoh, YRossello, A Design, synthesis and biological evaluation of bifunctional inhibitors of membrane type 1 matrix metalloproteinase (MT1-MMP). Bioorg Med Chem27:196-207 (2019) 
 
Matrix metalloproteinase-14
Name:Matrix metalloproteinase-14
Type:Protein
Mol. Mass.:65900.19
Organism:Homo sapiens (Human)
Description:P50281
Residue:582
BDBM50518291
NameBDBM50518291
Synonyms:CHEMBL4584813
TypeSmall organic molecule
Emp. Form.C70H72N10O18S2
Mol. Mass.1405.507
SMILESCOc1ccc(cc1)-c1ccc(cc1)S(=O)(=O)N(CCNC(=O)CCCNC(=O)c1cccc(c1)C(=O)NCCCC(=O)NCCN([C@H](CCN1C(=O)c2ccccc2C1=O)C(=O)NO)S(=O)(=O)c1ccc(cc1)-c1ccc(OC)cc1)[C@H](CCN1C(=O)c2ccccc2C1=O)C(=O)NO