Reaction Details
TargetMatrix metalloproteinase-14
LigandBDBM50119278
Substrate/Competitorn/a
Meas. Tech.ChEMBL_1871065 (CHEMBL4372232)
IC50 3.9±n/a nM
Citation Cuffaro, DNuti, EGifford, VIto, NCamodeca, CTuccinardi, TNencetti, SOrlandini, EItoh, YRossello, A Design, synthesis and biological evaluation of bifunctional inhibitors of membrane type 1 matrix metalloproteinase (MT1-MMP). Bioorg Med Chem27:196-207 (2019) 
 
Matrix metalloproteinase-14
Name:Matrix metalloproteinase-14
Type:Protein
Mol. Mass.:65900.19
Organism:Homo sapiens (Human)
Description:P50281
Residue:582
BDBM50119278
NameBDBM50119278
Synonyms:CHEMBL3617407
TypeSmall organic molecule
Emp. Form.C28H29N3O8S
Mol. Mass.567.61
SMILESCOc1ccc(cc1)-c1ccc(cc1)S(=O)(=O)N(OC(C)C)[C@H](CCN1C(=O)c2ccccc2C1=O)C(=O)NO