Reaction Details
Target72 kDa type IV collagenase
LigandBDBM50119278
Substrate/Competitorn/a
Meas. Tech.ChEMBL_1871063 (CHEMBL4372230)
IC50 0.670000±n/a nM
Citation Cuffaro, DNuti, EGifford, VIto, NCamodeca, CTuccinardi, TNencetti, SOrlandini, EItoh, YRossello, A Design, synthesis and biological evaluation of bifunctional inhibitors of membrane type 1 matrix metalloproteinase (MT1-MMP). Bioorg Med Chem27:196-207 (2019) 
 
72 kDa type IV collagenase
Name:72 kDa type IV collagenase
Type:Enzyme
Mol. Mass.:73870.36
Organism:Homo sapiens (Human)
Description: P08253
Residue:660
BDBM50119278
NameBDBM50119278
Synonyms:CHEMBL3617407
TypeSmall organic molecule
Emp. Form.C28H29N3O8S
Mol. Mass.567.61
SMILESCOc1ccc(cc1)-c1ccc(cc1)S(=O)(=O)N(OC(C)C)[C@H](CCN1C(=O)c2ccccc2C1=O)C(=O)NO