Reaction Details
TargetMelatonin receptor type 1B
LigandBDBM50072651
Substrate/Competitorn/a
Meas. Tech.ChEMBL_219514 (CHEMBL824491)
Ki>1000±n/a nM
Citation Kloubert, SMathé-Allainmat, MAndrieux, JSicsic, SLanglois, M Synthesis of benzocycloalkane derivatives as new conformationally restricted ligands for melatonin receptors. Bioorg Med Chem Lett8:3325-30 (1999) Melatonin receptor type 1B
Name:Melatonin receptor type 1B
Type:Enzyme Catalytic Domain
Mol. Mass.:33012.73
Organism:Chick
Description:Melatonin 0 Chick::P51050
Residue:289
BDBM50072651
NameBDBM50072651
Synonyms:CHEMBL113859 | N-(7-Methoxy-1,2,3,4-tetrahydro-naphthalen-1-ylmethyl)-propionamide
TypeSmall organic molecule
Emp. Form.C15H21NO2
Mol. Mass.247.3327
SMILESCCC(=O)NCC1CCCc2ccc(OC)cc12