Reaction Details
TargetMelatonin receptor type 1B
LigandBDBM50072654
Substrate/Competitorn/a
Meas. Tech.ChEBML_219514
Ki 4±n/a nM
Citation Kloubert, SMathé-Allainmat, MAndrieux, JSicsic, SLanglois, M Synthesis of benzocycloalkane derivatives as new conformationally restricted ligands for melatonin receptors. Bioorg Med Chem Lett8:3325-30 (1999) Melatonin receptor type 1B
Name:Melatonin receptor type 1B
Type:Enzyme Catalytic Domain
Mol. Mass.:33012.73
Organism:Chick
Description:Melatonin 0 Chick::P51050
Residue:289
BDBM50072654
NameBDBM50072654
Synonyms:CHEMBL113067 | N-(7-Methoxy-1,2,3,4-tetrahydro-naphthalen-1-ylmethyl)-acetamide
TypeSmall organic molecule
Emp. Form.C14H19NO2
Mol. Mass.233.3062
SMILESCOc1ccc2CCCC(CNC(C)=O)c2c1