Reaction Details
TargetMelatonin receptor type 1B
LigandBDBM50072657
Substrate/Competitorn/a
Meas. Tech.ChEBML_219514
Ki 34±n/a nM
Citation Kloubert, SMathé-Allainmat, MAndrieux, JSicsic, SLanglois, M Synthesis of benzocycloalkane derivatives as new conformationally restricted ligands for melatonin receptors. Bioorg Med Chem Lett8:3325-30 (1999) Melatonin receptor type 1B
Name:Melatonin receptor type 1B
Type:Enzyme Catalytic Domain
Mol. Mass.:33012.73
Organism:Chick
Description:Melatonin 0 Chick::P51050
Residue:289
BDBM50072657
NameBDBM50072657
Synonyms:CHEMBL320136 | N-(3-Methoxy-6,7,8,9-tetrahydro-5H-benzocyclohepten-5-ylmethyl)-acetamide
TypeSmall organic molecule
Emp. Form.C15H21NO2
Mol. Mass.247.3327
SMILESCOc1ccc2CCCCC(CNC(C)=O)c2c1