Reaction Details
Target5-hydroxytryptamine receptor 1A
LigandBDBM50072752
Substrate/Competitorn/a
Meas. Tech.ChEBML_202316
Ki 19±n/a nM
Citation Perez, MPauwels, PJPallard-Sigogneau, IFourrier, CChopin, PPalmier, CColovray, VHalazy, S Design and synthesis of new potent, silent 5-HT1A antagonists by covalent coupling of aminopropanol derivatives with selective serotonin reuptake inhibitors. Bioorg Med Chem Lett8:3423-8 (1999) 5-hydroxytryptamine receptor 1A
Name:5-hydroxytryptamine receptor 1A
Type:n/a
Mol. Mass.:46122.49
Organism:Homo sapiens (Human)
Description:n/a
Residue:422
BDBM50072752
NameBDBM50072752
Synonyms:1-(1H-Indol-4-yloxy)-3-[3-phenyl-3-(4-trifluoromethyl-phenoxy)-propylamino]-propan-2-ol | CHEMBL115003
TypeSmall organic molecule
Emp. Form.C27H27F3N2O3
Mol. Mass.484.5101
SMILESOC(CNCCC(Oc1ccc(cc1)C(F)(F)F)c1ccccc1)COc1cccc2[nH]ccc12