Reaction Details
TargetThromboxane-A synthase
LigandBDBM50072788
Substrate/Competitorn/a
Meas. Tech.ChEMBL_210434 (CHEMBL814386)
IC50 8.50±n/a nM
Citation Takeuchi, KKohn, TJTrue, TAMais, DEWikel, JHUtterback, BGWyss, VLJakubowski, JA Development of dual-acting agents for thromboxane receptor antagonism and thromboxane synthase inhibition. 3. Synthesis and biological activities of oxazolecarboxamide-substituted omega-phenyl-omega-(3-pyridyl)alkenoic acid derivatives and related compounds. J Med Chem41:5362-74 (1999) 
 
Thromboxane-A synthase
Name:Thromboxane-A synthase
Type:Enzyme
Mol. Mass.:60524.67
Organism:Homo sapiens (Human)
Description:P24557
Residue:533
BDBM50072788
NameBDBM50072788
Synonyms:(E)-7-{4-[4-((1R,2S)-2-Phenyl-cyclopropylcarbamoyl)-oxazol-2-yl]-phenyl}-7-pyridin-3-yl-hept-6-enoic acid | CHEMBL151519
TypeSmall organic molecule
Emp. Form.C31H29N3O4
Mol. Mass.507.5797
SMILESOC(=O)CCCC\C=C(/c1ccc(cc1)-c1nc(co1)C(=O)N[C@@H]1C[C@H]1c1ccccc1)c1cccnc1