Reaction Details
TargetThromboxane-A synthase
LigandBDBM50010960
Substrate/Competitorn/a
Meas. Tech.ChEMBL_210434 (CHEMBL814386)
IC50 48.7±n/a nM
Citation Takeuchi, KKohn, TJTrue, TAMais, DEWikel, JHUtterback, BGWyss, VLJakubowski, JA Development of dual-acting agents for thromboxane receptor antagonism and thromboxane synthase inhibition. 3. Synthesis and biological activities of oxazolecarboxamide-substituted omega-phenyl-omega-(3-pyridyl)alkenoic acid derivatives and related compounds. J Med Chem41:5362-74 (1999) 
 
Thromboxane-A synthase
Name:Thromboxane-A synthase
Type:Enzyme
Mol. Mass.:60524.67
Organism:Homo sapiens (Human)
Description:P24557
Residue:533
BDBM50010960
NameBDBM50010960
Synonyms:(E)-7-Phenyl-7-pyridin-3-yl-hept-6-enoic acid 7-Phenyl-7-pyridin-3-yl-hept-6-enoic acid(CV-4151) CV-4151
TypeSmall organic molecule
Emp. Form.C18H19NO2
Mol. Mass.281.349
SMILESOC(=O)CCCC\C=C(/c1ccccc1)c1cccnc1