Reaction Details
TargetThromboxane-A synthase
LigandBDBM50072785
Substrate/Competitorn/a
Meas. Tech.ChEMBL_210434 (CHEMBL814386)
IC50 9.4±n/a nM
Citation Takeuchi, KKohn, TJTrue, TAMais, DEWikel, JHUtterback, BGWyss, VLJakubowski, JA Development of dual-acting agents for thromboxane receptor antagonism and thromboxane synthase inhibition. 3. Synthesis and biological activities of oxazolecarboxamide-substituted omega-phenyl-omega-(3-pyridyl)alkenoic acid derivatives and related compounds. J Med Chem41:5362-74 (1999) 
 
Thromboxane-A synthase
Name:Thromboxane-A synthase
Type:Enzyme
Mol. Mass.:60524.67
Organism:Homo sapiens (Human)
Description:P24557
Residue:533
BDBM50072785
NameBDBM50072785
Synonyms:(E)-7-[4-(4-Phenethylcarbamoyl-oxazol-2-yl)-phenyl]-7-pyridin-3-yl-hept-6-enoic acid | CHEMBL150563
TypeSmall organic molecule
Emp. Form.C30H29N3O4
Mol. Mass.495.569
SMILESOC(=O)CCCC\C=C(/c1ccc(cc1)-c1nc(co1)C(=O)NCCc1ccccc1)c1cccnc1