Reaction Details
TargetThromboxane-A synthase
LigandBDBM50003795
Substrate/Competitorn/a
Meas. Tech.ChEMBL_210434 (CHEMBL814386)
IC50 14.7±n/a nM
Citation Takeuchi, KKohn, TJTrue, TAMais, DEWikel, JHUtterback, BGWyss, VLJakubowski, JA Development of dual-acting agents for thromboxane receptor antagonism and thromboxane synthase inhibition. 3. Synthesis and biological activities of oxazolecarboxamide-substituted omega-phenyl-omega-(3-pyridyl)alkenoic acid derivatives and related compounds. J Med Chem41:5362-74 (1999) 
 
Thromboxane-A synthase
Name:Thromboxane-A synthase
Type:Enzyme
Mol. Mass.:60524.67
Organism:Homo sapiens (Human)
Description:P24557
Residue:533
BDBM50003795
NameBDBM50003795
Synonyms:5-[1-Pyridin-3-yl-1-(3-trifluoromethyl-phenyl)-meth-(E)-ylideneaminooxy]-pentanoic acid CHEMBL280728 ridogrel
TypeSmall organic molecule
Emp. Form.C18H17F3N2O3
Mol. Mass.366.3344
SMILESOC(=O)CCCCO\N=C(\c1cccnc1)c1cccc(c1)C(F)(F)F